We now are offering Devs Base Swag. Get yours now.
https://teespring.com/devs-base-swag
http://www.zazzle.com/devs_base

Error d802/boot.img missing - LG G2 AOSIP (unofficial)

#1
Hello,

i'm trying to build AOSIP for LG G2 802 and the process stops with this error:

ninja: error: '/home/android/aosip/out/target/product/d802/dt.img', needed by '/home/android/aosip/out/target/product/d802/boot.img', missing and no known rule to make it

I've successfully bulided other ROM (most LineageOS based) like AOKP, OCT and other but with AOSIP I get always this problem. :(

Anyone can help me to understand what I'm doing wrong?

Thanks :)

This is the complete log of the build, it stops at the beginning

Running kati to generate build-aosip_d802.ninja...
/home/android/aosip/out/build-aosip_d802.ninja is missing, regenerating...
============================================
PLATFORM_VERSION_CODENAME=REL
PLATFORM_VERSION=7.1.1
TARGET_PRODUCT=aosip_d802
TARGET_BUILD_VARIANT=userdebug
TARGET_BUILD_TYPE=release
TARGET_BUILD_APPS=
TARGET_ARCH=arm
TARGET_ARCH_VARIANT=armv7-a-neon
TARGET_CPU_VARIANT=krait
TARGET_2ND_ARCH=
TARGET_2ND_ARCH_VARIANT=
TARGET_2ND_CPU_VARIANT=
HOST_ARCH=x86_64
HOST_2ND_ARCH=x86
HOST_OS=linux
HOST_OS_EXTRA=Linux-4.4.0-62-generic-x86_64-with-Ubuntu-16.04-xenial
HOST_CROSS_OS=windows
HOST_CROSS_ARCH=x86
HOST_CROSS_2ND_ARCH=x86_64
HOST_BUILD_TYPE=release
BUILD_ID=NMF26F
OUT_DIR=/home/android/aosip/out
============================================
Checking build tools versions...
FindEmulator: find: `cts/apps/CtsVerifier/src/android': No such file or directory
FindEmulator: find: `cts/hostsidetests/os/test-apps/HostLinkVerificationApp/src': No such file or directory
FindEmulator: find: `cts/libs/commonutil/src': No such file or directory
FindEmulator: cd: cts/tests/libcore/ojluni/resources: No such file or directory
FindEmulator: find: `cts/libs/commonutil/src': No such file or directory
build/core/binary.mk:1251: external/deqp/Android.mk: libdeqp: Unused source files: \
FindEmulator: find: `external/ims/provider/java': No such file or directory
build/core/binary.mk:37: modetest uses kernel headers, but does not depend on them!
build/core/binary.mk:1251: external/pdfium/third_party/pdfiumbigint.mk: libpdfiumbigint: Unused source files: bigint/BigInteger.cc bigint/BigIntegerUtils.cc bigint/BigUnsigned.cc bigint/BigUnsignedInABase.cc
frameworks/av/camera/cameraserver/Android.mk:18: Target has integrated cameraserver into mediaserver. This is weakening security measures introduced in 7.0
build/core/package_internal.mk:143: Empty argument supplied to find-subdir-assets
FindEmulator: find: `frameworks/opt/bluetooth/src/android/bluetooth/client/pbap': No such file or directory
find: ‘/home/android/aosip/out/target/common/obj/SHARED_LIBRARIES/libwifi-hal-mock_intermediates’: No such file or directory
FindEmulator: find: `frameworks/support/design/dummy': No such file or directory
build/core/package_internal.mk:143: Empty argument supplied to find-subdir-assets
FindEmulator: find: `frameworks/support/v17/leanback/dummy': No such file or directory
FindEmulator: find: `frameworks/support/v17/preference-leanback/dummy': No such file or directory
FindEmulator: find: `packages/services/Car/car-support-lib/dummy': No such file or directory
FindEmulator: find: `prebuilts/tools/android-arm': No such file or directory
No private recovery resources for TARGET_DEVICE d802
build/core/base_rules.mk:316: warning: overriding commands for target `/home/android/aosip/out/target/product/d802/root/res/images/charger/battery_fail.png'
build/core/base_rules.mk:316: warning: ignoring old commands for target `/home/android/aosip/out/target/product/d802/root/res/images/charger/battery_fail.png'
build/core/Makefile:45: warning: overriding commands for target `/home/android/aosip/out/target/product/d802/system/lib/libril.so'
build/core/base_rules.mk:316: warning: ignoring old commands for target `/home/android/aosip/out/target/product/d802/system/lib/libril.so'
Starting build with ninja
ninja: Entering directory `.'
ninja: error: '/home/android/aosip/out/target/product/d802/dt.img', needed by '/home/android/aosip/out/target/product/d802/boot.img', missing and no known rule to make it
build/core/ninja.mk:151: recipe for target 'ninja_wrapper' failed
make: *** [ninja_wrapper] Error 1

#### make failed to build some targets (28 seconds) ####

[email protected]:~/aosip$


Return to “Compiling Errors”

Who is online

Users browsing this forum: No registered users and 1 guest

cron